Reaction Details
TargetPotassium voltage-gated channel subfamily H member 2
LigandBDBM50117913
Substrate/Competitorn/a
Meas. Tech.ChEMBL_307245 (CHEMBL829152)
IC50 1412.54±n/a nM
Citation Tobita, MNishikawa, TNagashima, R A discriminant model constructed by the support vector machine method for HERG potassium channel inhibitors. Bioorg Med Chem Lett15:2886-90 (2005) 
 
Potassium voltage-gated channel subfamily H member 2
Name:Potassium voltage-gated channel subfamily H member 2
Type:Multi-pass membrane protein
Mol. Mass.:126672.65
Organism:Homo sapiens (Human)
Description:Q12809
Residue:1159
BDBM50117913
NameBDBM50117913
Synonyms:(E)-1-((5-(4-chlorophenyl)furan-2-yl)methyleneamino)-3-(4-(4-methylpiperazin-1-yl)butyl)imidazolidine-2,4-dione 1-{[5-(4-Chloro-phenyl)-furan-2-ylmethylene]-amino}-3-[4-(4-methyl-piperazin-1-yl)-butyl]-imidazolidine-2,4-dione(Azimilide) AZIMILIDE DIHYDROCHLORIDE | CHEMBL123558
TypeSmall organic molecule
Emp. Form.C23H28ClN5O3
Mol. Mass.457.953
SMILESCN1CCN(CCCCn2c(O)cn(N=Cc3ccc(o3)-c3ccc(Cl)cc3)c2=O)CC1