Reaction Details
TargetPotassium voltage-gated channel subfamily H member 2
LigandBDBM50027391
Substrate/Competitorn/a
Meas. Tech.ChEMBL_307245 (CHEMBL829152)
IC50 2187.76±n/a nM
Citation Tobita, MNishikawa, TNagashima, R A discriminant model constructed by the support vector machine method for HERG potassium channel inhibitors. Bioorg Med Chem Lett15:2886-90 (2005) 
 
Potassium voltage-gated channel subfamily H member 2
Name:Potassium voltage-gated channel subfamily H member 2
Type:Multi-pass membrane protein
Mol. Mass.:126672.65
Organism:Homo sapiens (Human)
Description:Q12809
Residue:1159
BDBM50027391
NameBDBM50027391
Synonyms:Acetic acid (1S,4S)-4-dimethylamino-1-ethyl-2,2-diphenyl-pentyl ester Alphacetylmethadol Methadyl acetate | alpha-(-)-Acetylmethadol
TypeSmall organic molecule
Emp. Form.C23H31NO2
Mol. Mass.353.4977
SMILESCCC(OC(C)=O)C(CC(C)N(C)C)(c1ccccc1)c1ccccc1