Reaction Details
TargetATP-dependent molecular chaperone HSP82
LigandBDBM50409994
Substrate/Competitorn/a
Meas. Tech.ChEMBL_304597 (CHEMBL828486)
IC50 2400±n/a nM
Citation Cheung, KMMatthews, TPJames, KRowlands, MGBoxall, KJSharp, SYMaloney, ARoe, SMProdromou, CPearl, LHAherne, GWMcDonald, EWorkman, P The identification, synthesis, protein crystal structure and in vitro biochemical evaluation of a new 3,4-diarylpyrazole class of Hsp90 inhibitors. Bioorg Med Chem Lett15:3338-43 (2005) 
 
ATP-dependent molecular chaperone HSP82
Name:ATP-dependent molecular chaperone HSP82
Type:Molecular Chaperone
Mol. Mass.:81369.08
Organism:Saccharomyces cerevisiae
Description:Histidine-tagged yeast HSP90 was transformed into E. coli and purified (>90%) by metal affinity, gel filtration, and ion-exchange chromatography.
Residue:709
BDBM50409994
NameBDBM50409994
Synonyms:CHEMBL188495
TypeSmall organic molecule
Emp. Form.C19H16ClN3O3
Mol. Mass.369.802
SMILESOc1cc(O)c(cc1Cl)-c1n[nH]cc1-c1cccc(OCCCC#N)c1