Reaction Details
TargetCyclin-dependent kinase inhibitor 1
LigandBDBM50410010
Substrate/Competitorn/a
Meas. Tech.ChEMBL_312386 (CHEMBL833769)
IC50 4100±n/a nM
Citation Wang, YDJohnson, SPowell, DMcGinnis, JPMiranda, MRabindran, SK Inhibition of tumor cell proliferation by thieno[2,3-d]pyrimidin-4(1H)-one-based analogs. Bioorg Med Chem Lett15:3763-6 (2005) 
 
Cyclin-dependent kinase inhibitor 1
Name:Cyclin-dependent kinase inhibitor 1
Type:PROTEIN
Mol. Mass.:18123.15
Organism:Homo sapiens (Human)
Description:ChEMBL_312386
Residue:164
BDBM50410010
NameBDBM50410010
Synonyms:CHEMBL179916
TypeSmall organic molecule
Emp. Form.C17H16N2OS2
Mol. Mass.328.452
SMILESCSc1ccc(cc1)-c1nc2sc3CCCCc3c2c(=O)[nH]1