Reaction Details
TargetCyclin-dependent kinase inhibitor 1
LigandBDBM50410021
Substrate/Competitorn/a
Meas. Tech.ChEMBL_312386 (CHEMBL833769)
IC50>20000±n/a nM
Citation Wang, YDJohnson, SPowell, DMcGinnis, JPMiranda, MRabindran, SK Inhibition of tumor cell proliferation by thieno[2,3-d]pyrimidin-4(1H)-one-based analogs. Bioorg Med Chem Lett15:3763-6 (2005) 
 
Cyclin-dependent kinase inhibitor 1
Name:Cyclin-dependent kinase inhibitor 1
Type:PROTEIN
Mol. Mass.:18123.15
Organism:Homo sapiens (Human)
Description:ChEMBL_312386
Residue:164
BDBM50410021
NameBDBM50410021
Synonyms:CHEMBL179692
TypeSmall organic molecule
Emp. Form.C17H16N2OS
Mol. Mass.296.387
SMILESCc1ccc(cc1)-c1nc2sc3CCCCc3c2c(=O)[nH]1