Reaction Details
TargetCyclin-dependent kinase inhibitor 1
LigandBDBM50410009
Substrate/Competitorn/a
Meas. Tech.ChEMBL_312419 (CHEMBL832970)
IC50 6600±n/a nM
Citation Wang, YDJohnson, SPowell, DMcGinnis, JPMiranda, MRabindran, SK Inhibition of tumor cell proliferation by thieno[2,3-d]pyrimidin-4(1H)-one-based analogs. Bioorg Med Chem Lett15:3763-6 (2005) 
 
Cyclin-dependent kinase inhibitor 1
Name:Cyclin-dependent kinase inhibitor 1
Type:PROTEIN
Mol. Mass.:18123.15
Organism:Homo sapiens (Human)
Description:ChEMBL_312386
Residue:164
BDBM50410009
NameBDBM50410009
Synonyms:CHEMBL178807
TypeSmall organic molecule
Emp. Form.C20H22N2O4S
Mol. Mass.386.465
SMILESCOc1cc(cc(OC)c1OC)-c1nc2sc3CCCCCc3c2c(=O)[nH]1