Reaction Details
TargetCyclin-dependent kinase inhibitor 1
LigandBDBM50410020
Substrate/Competitorn/a
Meas. Tech.ChEMBL_312419 (CHEMBL832970)
IC50>20000±n/a nM
Citation Wang, YDJohnson, SPowell, DMcGinnis, JPMiranda, MRabindran, SK Inhibition of tumor cell proliferation by thieno[2,3-d]pyrimidin-4(1H)-one-based analogs. Bioorg Med Chem Lett15:3763-6 (2005) 
 
Cyclin-dependent kinase inhibitor 1
Name:Cyclin-dependent kinase inhibitor 1
Type:PROTEIN
Mol. Mass.:18123.15
Organism:Homo sapiens (Human)
Description:ChEMBL_312386
Residue:164
BDBM50410020
NameBDBM50410020
Synonyms:CHEMBL538355
TypeSmall organic molecule
Emp. Form.C24H23NO3S2
Mol. Mass.437.574
SMILESCOc1cc(cc(OC)c1OC)-c1cc(-c2cccs2)c2c3CCCCc3sc2n1