Reaction Details
TargetPotassium voltage-gated channel subfamily KQT member 2
LigandBDBM50410080
Substrate/Competitorn/a
Meas. Tech.ChEMBL_310664 (CHEMBL838011)
EC50 1200±n/a nM
Citation L'Heureux, AMartel, AHe, HChen, JSun, LQStarrett, JENatale, JDworetzky, SIKnox, RJHarden, DGWeaver, DThompson, MWWu, YJ (S,E)-N-[1-(3-heteroarylphenyl)ethyl]-3-(2-fluorophenyl)acrylamides: synthesis and KCNQ2 potassium channel opener activity. Bioorg Med Chem Lett15:363-6 (2004) 
 
Potassium voltage-gated channel subfamily KQT member 2
Name:Potassium voltage-gated channel subfamily KQT member 2
Type:PROTEIN
Mol. Mass.:84494.02
Organism:Mus musculus
Description:ChEMBL_990142
Residue:759
BDBM50410080
NameBDBM50410080
Synonyms:CHEMBL183138
TypeSmall organic molecule
Emp. Form.C22H19FN2O
Mol. Mass.346.3975
SMILESC[C@H](NC(=O)\C=C\c1ccccc1F)c1cccc(c1)-c1ccccn1