Reaction Details
TargetPotassium voltage-gated channel subfamily KQT member 2
LigandBDBM50410081
Substrate/Competitorn/a
Meas. Tech.ChEMBL_310664 (CHEMBL838011)
EC50 10±n/a nM
Citation L'Heureux, AMartel, AHe, HChen, JSun, LQStarrett, JENatale, JDworetzky, SIKnox, RJHarden, DGWeaver, DThompson, MWWu, YJ (S,E)-N-[1-(3-heteroarylphenyl)ethyl]-3-(2-fluorophenyl)acrylamides: synthesis and KCNQ2 potassium channel opener activity. Bioorg Med Chem Lett15:363-6 (2004) 
 
Potassium voltage-gated channel subfamily KQT member 2
Name:Potassium voltage-gated channel subfamily KQT member 2
Type:PROTEIN
Mol. Mass.:84494.02
Organism:Mus musculus
Description:ChEMBL_990142
Residue:759
BDBM50410081
NameBDBM50410081
Synonyms:CHEMBL361184
TypeSmall organic molecule
Emp. Form.C22H18F2N2O
Mol. Mass.364.3879
SMILESC[C@H](NC(=O)\C=C\c1ccccc1F)c1cccc(c1)-c1ccc(F)nc1