Reaction Details
TargetNeuronal acetylcholine receptor subunit alpha-3/beta-4
LigandBDBM50161084
Substrate/Competitorn/a
Meas. Tech.ChEMBL_310813 (CHEMBL825005)
EC50>100±n/a nM
Citation Fitch, RWKaneko, YKlaperski, PDaly, JWSeitz, GGündisch, D Halogenated and isosteric cytisine derivatives with increased affinity and functional activity at nicotinic acetylcholine receptors. Bioorg Med Chem Lett15:1221-4 (2005) 
 
Neuronal acetylcholine receptor subunit alpha-3/beta-4
Name:Neuronal acetylcholine receptor subunit alpha-3/beta-4
Type:Protein
Mol. Mass.:n/a
Description:n/a
Components:This complex has 2 components.
Component 1
Name:Neuronal acetylcholine receptor subunit alpha-3
Synonyms:ACHA3_RAT Chrna3
Type:Enzyme
Mol. Mass.:56995.52
Organism:Rattus norvegicus (Rat)
Description:P04757
Residue:499
Component 2
Name:Neuronal acetylcholine receptor subunit beta-4
Synonyms:ACHB4_RAT Chrnb4 Neuronal acetylcholine receptor non-alpha-2 chain | Neuronal acetylcholine receptor protein beta-4 subunit
Type:Enzyme
Mol. Mass.:55863.89
Organism:Rattus norvegicus (Rat)
Description:P12392
Residue:495
BDBM50161084
NameBDBM50161084
Synonyms:1,2,3,4,5,6-Hexahydro-1,5-methano-pyrido[1,2-a][1,5]diazocine-8-thione | CHEMBL293649
TypeSmall organic molecule
Emp. Form.C11H14N2S
Mol. Mass.206.307
SMILESS=c1cccc2C3CNCC(C3)Cn12