Reaction Details
TargetNeuronal acetylcholine receptor subunit alpha-3/beta-4
LigandBDBM50161083
Substrate/Competitorn/a
Meas. Tech.ChEMBL_310813 (CHEMBL825005)
EC50>100±n/a nM
Citation Fitch, RWKaneko, YKlaperski, PDaly, JWSeitz, GGündisch, D Halogenated and isosteric cytisine derivatives with increased affinity and functional activity at nicotinic acetylcholine receptors. Bioorg Med Chem Lett15:1221-4 (2005) 
 
Neuronal acetylcholine receptor subunit alpha-3/beta-4
Name:Neuronal acetylcholine receptor subunit alpha-3/beta-4
Type:Protein
Mol. Mass.:n/a
Description:n/a
Components:This complex has 2 components.
Component 1
Name:Neuronal acetylcholine receptor subunit alpha-3
Synonyms:ACHA3_RAT Chrna3
Type:Enzyme
Mol. Mass.:56995.52
Organism:Rattus norvegicus (Rat)
Description:P04757
Residue:499
Component 2
Name:Neuronal acetylcholine receptor subunit beta-4
Synonyms:ACHB4_RAT Chrnb4 Neuronal acetylcholine receptor non-alpha-2 chain | Neuronal acetylcholine receptor protein beta-4 subunit
Type:Enzyme
Mol. Mass.:55863.89
Organism:Rattus norvegicus (Rat)
Description:P12392
Residue:495
BDBM50161083
NameBDBM50161083
Synonyms:11,11-dimethyl-6-oxo-7-aza-11-azoniatricyclo[7.3.1.0~2,7~]trideca-2,4-diene iodide | CHEMBL181840
TypeSmall organic molecule
Emp. Form.C13H19N2O
Mol. Mass.219.3022
SMILESC[N+]1(C)CC2CC(C1)c1cccc(=O)n1C2