Reaction Details
TargetIntegrin alpha-V/beta-3
LigandBDBM50153026
Substrate/Competitorn/a
Meas. Tech.ChEMBL_306120 (CHEMBL830070)
IC50 0.11±n/a nM
Citation Coleman, PJBrashear, KMAskew, BCHutchinson, JHMcVean, CADuong, le TFeuston, BPFernandez-Metzler, CGentile, MAHartman, GDKimmel, DBLeu, CTLipfert, LMerkle, KPennypacker, BPrueksaritanont, TRodan, GAWesolowski, GARodan, SBDuggan, ME Nonpeptide alphavbeta3 antagonists. Part 11: discovery and preclinical evaluation of potent alphavbeta3 antagonists for the prevention and treatment of osteoporosis. J Med Chem47:4829-37 (2004) 
 
Integrin alpha-V/beta-3
Name:Integrin alpha-V/beta-3
Type:Enzyme
Mol. Mass.:n/a
Description:n/a
Components:This complex has 2 components.
Component 1
Name:Integrin alpha-V
Synonyms:ITAV_HUMAN Integrin alpha-V/alpha-5 VNRA Vitronectin receptor | Vitronectin receptor subunit alpha
Type:PROTEIN
Mol. Mass.:116024.92
Organism:Homo sapiens (Human)
Description:ChEMBL_582336
Residue:1048
Component 2
Name:Integrin beta-3
Synonyms:CD_antigen=CD61 GPIIIa ITGB3 Platelet membrane glycoprotein IIIa
Type:Protein
Mol. Mass.:87038.91
Organism:Homo sapiens (Human)
Description:P05106
Residue:788
BDBM50153026
NameBDBM50153026
Synonyms:(S)-3-(2-Methoxy-pyrimidin-5-yl)-9-(5,6,7,8-tetrahydro-[1,8]naphthyridin-2-yl)-nonanoic acid | CHEMBL186126
TypeSmall organic molecule
Emp. Form.C22H30N4O3
Mol. Mass.398.4986
SMILESCOc1ncc(cn1)[C@@H](CCCCCCc1ccc2CCCNc2n1)CC(O)=O