Reaction Details
Target1-deoxy-D-xylulose 5-phosphate reductoisomerase
LigandBDBM50422650
Substrate/Competitorn/a
Meas. Tech.ChEMBL_307250 (CHEMBL829156)
IC50 65±n/a nM
Citation Silber, KHeidler, PKurz, TKlebe, G AFMoC enhances predictivity of 3D QSAR: a case study with DOXP-reductoisomerase. J Med Chem48:3547-63 (2005) 
 
1-deoxy-D-xylulose 5-phosphate reductoisomerase
Name:1-deoxy-D-xylulose 5-phosphate reductoisomerase
Type:Protein
Mol. Mass.:43384.52
Organism:Escherichia coli
Description:P45568
Residue:398
BDBM50422650
NameBDBM50422650
Synonyms:CHEMBL606521
TypeSmall organic molecule
Emp. Form.C5H10NO5P
Mol. Mass.195.1104
SMILESCC(=O)N(O)CC=CP(O)(O)=O