Reaction Details
Target1-deoxy-D-xylulose 5-phosphate reductoisomerase
LigandBDBM50422669
Substrate/Competitorn/a
Meas. Tech.ChEMBL_307250 (CHEMBL829156)
IC50 54±n/a nM
Citation Silber, KHeidler, PKurz, TKlebe, G AFMoC enhances predictivity of 3D QSAR: a case study with DOXP-reductoisomerase. J Med Chem48:3547-63 (2005) 
 
1-deoxy-D-xylulose 5-phosphate reductoisomerase
Name:1-deoxy-D-xylulose 5-phosphate reductoisomerase
Type:Protein
Mol. Mass.:43384.52
Organism:Escherichia coli
Description:P45568
Residue:398
BDBM50422669
NameBDBM50422669
Synonyms:CHEMBL607359 | UK-513
TypeSmall organic molecule
Emp. Form.C6H14NO5P
Mol. Mass.211.1528
SMILESCC(CCN(O)C(C)=O)P(O)(O)=O