Reaction Details
TargetMelanocortin receptor 5
LigandBDBM50410239
Substrate/Competitorn/a
Meas. Tech.ChEMBL_307553 (CHEMBL831266)
IC50 631±n/a nM
Citation Kruijtzer, JANijenhuis, WAWanders, NGispen, WHLiskamp, RMAdan, RA Peptoid-peptide hybrids as potent novel melanocortin receptor ligands. J Med Chem48:4224-30 (2005) 
 
Melanocortin receptor 5
Name:Melanocortin receptor 5
Type:Enzyme
Mol. Mass.:36966.58
Organism:Mus musculus (Mouse)
Description:P41149
Residue:325
BDBM50410239
NameBDBM50410239
Synonyms:CHEMBL190953
TypeSmall organic molecule
Emp. Form.C44H65N13O8
Mol. Mass.904.0692
SMILESCCCC[C@H](NC(C)=O)C(=O)NCC(=O)N(CCCCN)CC(=O)N[C@H](Cc1ccccc1)C(=O)N[C@@H](CCCNC(N)=N)C(=O)N(CC(=O)NCC(N)=O)Cc1c[nH]c2ccccc12