Reaction Details
TargetMelanocortin receptor 5
LigandBDBM50410247
Substrate/Competitorn/a
Meas. Tech.ChEMBL_307553 (CHEMBL831266)
IC50 501±n/a nM
Citation Kruijtzer, JANijenhuis, WAWanders, NGispen, WHLiskamp, RMAdan, RA Peptoid-peptide hybrids as potent novel melanocortin receptor ligands. J Med Chem48:4224-30 (2005) 
 
Melanocortin receptor 5
Name:Melanocortin receptor 5
Type:Enzyme
Mol. Mass.:36966.58
Organism:Mus musculus (Mouse)
Description:P41149
Residue:325
BDBM50410247
NameBDBM50410247
Synonyms:CHEMBL190080
TypeSmall organic molecule
Emp. Form.C46H69N13O8
Mol. Mass.932.1224
SMILESCCCC[C@H](NC(C)=O)C(=O)NCC(=O)N[C@@H](CCCCN)C(=O)N[C@H](Cc1ccccc1)C(=O)N(CCCCNC(N)=N)CC(=O)N(CCc1c[nH]c2ccccc12)CC(=O)NCC(N)=O