Reaction Details
TargetRNA-directed RNA polymerase
LigandBDBM50410391
Substrate/Competitorn/a
Meas. Tech.ChEMBL_302873 (CHEMBL828787)
Ki 229000±n/a nM
Citation Koh, YHShim, JHWu, JZZhong, WHong, ZGirardet, JL Design, synthesis, and antiviral activity of adenosine 5'-phosphonate analogues as chain terminators against hepatitis C virus. J Med Chem48:2867-75 (2005) 
 
RNA-directed RNA polymerase
Name:RNA-directed RNA polymerase
Type:Protein
Mol. Mass.:25173.95
Organism:Hepatitis C virus
Description:Q8JXU8
Residue:229
BDBM50410391
NameBDBM50410391
Synonyms:CHEMBL1161753
TypeSmall organic molecule
Emp. Form.C11H20N5O12P3
Mol. Mass.507.2241
SMILESNc1ncnc2n(cnc12)[C@@H]1C[C@H](OCP(O)(=O)OP(O)(=O)OP(O)(O)O)[C@@H](O)[C@H]1O