Reaction Details
TargetRNA-directed RNA polymerase
LigandBDBM50410392
Substrate/Competitorn/a
Meas. Tech.ChEMBL_302873 (CHEMBL828787)
Ki 327000±n/a nM
Citation Koh, YHShim, JHWu, JZZhong, WHong, ZGirardet, JL Design, synthesis, and antiviral activity of adenosine 5'-phosphonate analogues as chain terminators against hepatitis C virus. J Med Chem48:2867-75 (2005) 
 
RNA-directed RNA polymerase
Name:RNA-directed RNA polymerase
Type:Protein
Mol. Mass.:25173.95
Organism:Hepatitis C virus
Description:Q8JXU8
Residue:229
BDBM50410392
NameBDBM50410392
Synonyms:CHEMBL1161773
TypeSmall organic molecule
Emp. Form.C12H22N5O12P3
Mol. Mass.521.2507
SMILESC[C@@]1(O)[C@H](O)[C@@H](CCP(O)(=O)OP(O)(=O)OP(O)(O)O)O[C@H]1n1cnc2c(N)ncnc12