Reaction Details
Target5-hydroxytryptamine receptor 1A
LigandBDBM50410432
Substrate/Competitorn/a
Meas. Tech.ChEMBL_321087 (CHEMBL883690)
Ki 1.58±n/a nM
Citation Heightman, TDGaster, LMPardoe, SLPilleux, JPHadley, MSMiddlemiss, DNPrice, GWRoberts, CScott, CMWatson, JMGordon, LJHolland, VAPowles, JRiley, GJStean, TOTrail, BKUpton, NAustin, NEAyrton, ADColeman, TCutler, L 8-Piperazinyl-2,3-dihydropyrrolo[3,2-g]isoquinolines: potent, selective, orally bioavailable 5-HT1 receptor ligands. Bioorg Med Chem Lett15:4370-4 (2005) 
 
5-hydroxytryptamine receptor 1A
Name:5-hydroxytryptamine receptor 1A
Type:n/a
Mol. Mass.:46122.49
Organism:Homo sapiens (Human)
Description:n/a
Residue:422
BDBM50410432
NameBDBM50410432
Synonyms:CHEMBL197947
TypeSmall organic molecule
Emp. Form.C31H31N7O
Mol. Mass.517.6241
SMILESCCc1c(cnn1-c1ccc(cc1)C#N)C(=O)N1CCc2cc3ccnc(N4CCN5CCC[C@@H]5C4)c3cc12