Reaction Details
Target5-hydroxytryptamine receptor 1B
LigandBDBM50410434
Substrate/Competitorn/a
Meas. Tech.ChEMBL_321088 (CHEMBL883691)
Ki 2.51±n/a nM
Citation Heightman, TDGaster, LMPardoe, SLPilleux, JPHadley, MSMiddlemiss, DNPrice, GWRoberts, CScott, CMWatson, JMGordon, LJHolland, VAPowles, JRiley, GJStean, TOTrail, BKUpton, NAustin, NEAyrton, ADColeman, TCutler, L 8-Piperazinyl-2,3-dihydropyrrolo[3,2-g]isoquinolines: potent, selective, orally bioavailable 5-HT1 receptor ligands. Bioorg Med Chem Lett15:4370-4 (2005) 
 
5-hydroxytryptamine receptor 1B
Name:5-hydroxytryptamine receptor 1B
Type:G Protein-Coupled Receptor (GPCR)
Mol. Mass.:43579.17
Organism:Homo sapiens (Human)
Description:Receptor binding assays were performed using human clone stably expressed in CHO cells
Residue:390
BDBM50410434
NameBDBM50410434
Synonyms:CHEMBL372651
TypeSmall organic molecule
Emp. Form.C28H27N7O
Mol. Mass.477.5603
SMILESCCc1c(cnn1-c1ccc(cc1)C#N)C(=O)N1CCc2cc3ccnc(N4CCNCC4)c3cc12