Reaction Details
Target5-hydroxytryptamine receptor 1B
LigandBDBM50410435
Substrate/Competitorn/a
Meas. Tech.ChEMBL_321088 (CHEMBL883691)
Ki 7.94±n/a nM
Citation Heightman, TDGaster, LMPardoe, SLPilleux, JPHadley, MSMiddlemiss, DNPrice, GWRoberts, CScott, CMWatson, JMGordon, LJHolland, VAPowles, JRiley, GJStean, TOTrail, BKUpton, NAustin, NEAyrton, ADColeman, TCutler, L 8-Piperazinyl-2,3-dihydropyrrolo[3,2-g]isoquinolines: potent, selective, orally bioavailable 5-HT1 receptor ligands. Bioorg Med Chem Lett15:4370-4 (2005) 
 
5-hydroxytryptamine receptor 1B
Name:5-hydroxytryptamine receptor 1B
Type:G Protein-Coupled Receptor (GPCR)
Mol. Mass.:43579.17
Organism:Homo sapiens (Human)
Description:Receptor binding assays were performed using human clone stably expressed in CHO cells
Residue:390
BDBM50410435
NameBDBM50410435
Synonyms:CHEMBL191971 | SB-272183
TypeSmall organic molecule
Emp. Form.C29H28ClN5O
Mol. Mass.498.019
SMILESCN1CCN(CC1)c1cc2N(CCc2cc1Cl)C(=O)Nc1ccc(-c2ccncc2)c2ccccc12