Reaction Details
Target5-hydroxytryptamine receptor 1A
LigandBDBM50410424
Substrate/Competitorn/a
Meas. Tech.ChEMBL_321087 (CHEMBL883690)
Ki 3.16±n/a nM
Citation Heightman, TDGaster, LMPardoe, SLPilleux, JPHadley, MSMiddlemiss, DNPrice, GWRoberts, CScott, CMWatson, JMGordon, LJHolland, VAPowles, JRiley, GJStean, TOTrail, BKUpton, NAustin, NEAyrton, ADColeman, TCutler, L 8-Piperazinyl-2,3-dihydropyrrolo[3,2-g]isoquinolines: potent, selective, orally bioavailable 5-HT1 receptor ligands. Bioorg Med Chem Lett15:4370-4 (2005) 
 
5-hydroxytryptamine receptor 1A
Name:5-hydroxytryptamine receptor 1A
Type:n/a
Mol. Mass.:46122.49
Organism:Homo sapiens (Human)
Description:n/a
Residue:422
BDBM50410424
NameBDBM50410424
Synonyms:CHEMBL199088
TypeSmall organic molecule
Emp. Form.C23H22F3N5O
Mol. Mass.441.4489
SMILESCN1CCN(CC1)c1nccc2cc3CCN(C(=O)c4ccc(nc4)C(F)(F)F)c3cc12