Reaction Details
Target5-hydroxytryptamine receptor 1B
LigandBDBM50410438
Substrate/Competitorn/a
Meas. Tech.ChEMBL_321088 (CHEMBL883691)
Ki 5.01±n/a nM
Citation Heightman, TDGaster, LMPardoe, SLPilleux, JPHadley, MSMiddlemiss, DNPrice, GWRoberts, CScott, CMWatson, JMGordon, LJHolland, VAPowles, JRiley, GJStean, TOTrail, BKUpton, NAustin, NEAyrton, ADColeman, TCutler, L 8-Piperazinyl-2,3-dihydropyrrolo[3,2-g]isoquinolines: potent, selective, orally bioavailable 5-HT1 receptor ligands. Bioorg Med Chem Lett15:4370-4 (2005) 
 
5-hydroxytryptamine receptor 1B
Name:5-hydroxytryptamine receptor 1B
Type:G Protein-Coupled Receptor (GPCR)
Mol. Mass.:43579.17
Organism:Homo sapiens (Human)
Description:Receptor binding assays were performed using human clone stably expressed in CHO cells
Residue:390
BDBM50410438
NameBDBM50410438
Synonyms:CHEMBL196140
TypeSmall organic molecule
Emp. Form.C22H23F3N6O
Mol. Mass.444.4528
SMILESCN1CCN(CC1)c1nccc2cc3CCN(C(=O)c4cnn(C)c4C(F)(F)F)c3cc12