Reaction Details
Target5-hydroxytryptamine receptor 2C
LigandBDBM50410476
Substrate/Competitorn/a
Meas. Tech.ChEMBL_321084 (CHEMBL872164)
Ki 0.631±n/a nM
Citation Goodacre, CJBromidge, SMClapham, DKing, FDLovell, PJAllen, MCampbell, LPHolland, VRiley, GJStarr, KRTrail, BKWood, MD A series of bisaryl imidazolidin-2-ones has shown to be selective and orally active 5-HT2C receptor antagonists. Bioorg Med Chem Lett15:4989-93 (2005) 
 
5-hydroxytryptamine receptor 2C
Name:5-hydroxytryptamine receptor 2C
Type:G Protein-Coupled Receptor (GPCR)
Mol. Mass.:51836.79
Organism:Homo sapiens (Human)
Description:P28335
Residue:458
BDBM50410476
NameBDBM50410476
Synonyms:CHEMBL197630
TypeSmall organic molecule
Emp. Form.C25H29ClN2O3
Mol. Mass.440.962
SMILESCOc1cc2CCN(C(=O)\C=C\c3ccccc3Cl)c2cc1OCCN1CCCCC1