Reaction Details
Target5-hydroxytryptamine receptor 2B
LigandBDBM50086065
Substrate/Competitorn/a
Meas. Tech.ChEMBL_321080 (CHEMBL872160)
Ki 100±n/a nM
Citation Goodacre, CJBromidge, SMClapham, DKing, FDLovell, PJAllen, MCampbell, LPHolland, VRiley, GJStarr, KRTrail, BKWood, MD A series of bisaryl imidazolidin-2-ones has shown to be selective and orally active 5-HT2C receptor antagonists. Bioorg Med Chem Lett15:4989-93 (2005) 
 
5-hydroxytryptamine receptor 2B
Name:5-hydroxytryptamine receptor 2B
Type:G Protein-Coupled Receptor (GPCR)
Mol. Mass.:54312.47
Organism:Homo sapiens (Human)
Description:Receptor binding assays were performed using human clone stably expressed in CHO cells.
Residue:481
BDBM50086065
NameBDBM50086065
Synonyms:5-Methyl-6-trifluoromethyl-2,3-dihydro-indole-1-carboxylic acid [6-(2-methyl-pyridin-3-yloxy)-pyridin-3-yl]-amide CHEMBL14460 | SB-243213
TypeSmall organic molecule
Emp. Form.C22H19F3N4O2
Mol. Mass.428.4071
SMILESCc1cc2CCN(C(=O)Nc3ccc(Oc4cccnc4C)nc3)c2cc1C(F)(F)F