Reaction Details
TargetAndrogen receptor
LigandBDBM8885
Substrate/Competitorn/a
Meas. Tech.ChEMBL_321687 (CHEMBL872182)
IC50 3090.3±n/a nM
Citation Lill, MAWiniger, FVedani, AErnst, B Impact of induced fit on ligand binding to the androgen receptor: a multidimensional QSAR study to predict endocrine-disrupting effects of environmental chemicals. J Med Chem48:5666-74 (2005) 
 
Androgen receptor
Name:Androgen receptor
Type:Enzyme
Mol. Mass.:98219.08
Organism:Rattus norvegicus (Rat)
Description:P15207
Residue:902
BDBM8885
NameBDBM8885
Synonyms:(1S,2R,10R,11S,14S,15S)-14-hydroxy-2,15-dimethyltetracyclo[8.7.0.0^{2,7}.0^{11,15}]heptadec-6-en-5-one Testosterone US9682960, Testosterone
TypeSteroid
Emp. Form.C19H28O2
Mol. Mass.288.4244
SMILES[H][C@@]12CC[C@H](O)[C@@]1(C)CC[C@@]1([H])[C@@]2([H])CCC2=CC(=O)CC[C@]12C