Reaction Details
TargetAndrogen receptor
LigandBDBM50094569
Substrate/Competitorn/a
Meas. Tech.ChEMBL_321687 (CHEMBL872182)
IC50 630.96±n/a nM
Citation Lill, MAWiniger, FVedani, AErnst, B Impact of induced fit on ligand binding to the androgen receptor: a multidimensional QSAR study to predict endocrine-disrupting effects of environmental chemicals. J Med Chem48:5666-74 (2005) 
 
Androgen receptor
Name:Androgen receptor
Type:Enzyme
Mol. Mass.:98219.08
Organism:Rattus norvegicus (Rat)
Description:P15207
Residue:902
BDBM50094569
NameBDBM50094569
Synonyms:6-chloro-3,20-dioxo-1beta,2beta-dihydro-3'H-cyclopropa[1,2]pregna-4,6-dien-17-yl acetate Cyproterone 17-O-acetate cyproterone acetate
TypeSmall organic molecule
Emp. Form.C24H29ClO4
Mol. Mass.416.938
SMILESCC(=O)O[C@@]1(CC[C@H]2[C@@H]3C=C(Cl)C4=CC(=O)[C@@H]5C[C@@H]5[C@]4(C)[C@H]3CC[C@]12C)C(C)=O