Reaction Details
TargetAndrogen receptor
LigandBDBM50410541
Substrate/Competitorn/a
Meas. Tech.ChEMBL_321687 (CHEMBL872182)
IC50 2.24±n/a nM
Citation Lill, MAWiniger, FVedani, AErnst, B Impact of induced fit on ligand binding to the androgen receptor: a multidimensional QSAR study to predict endocrine-disrupting effects of environmental chemicals. J Med Chem48:5666-74 (2005) 
 
Androgen receptor
Name:Androgen receptor
Type:Enzyme
Mol. Mass.:98219.08
Organism:Rattus norvegicus (Rat)
Description:P15207
Residue:902
BDBM50410541
NameBDBM50410541
Synonyms:CHEMBL194467
TypeSmall organic molecule
Emp. Form.C19H30O2
Mol. Mass.290.4403
SMILESC[C@]12CC[C@H]3[C@@H](CC[C@H]4CC(=O)CC[C@]34C)[C@@H]1CC[C@H]2O