Reaction Details
TargetGastrin/cholecystokinin type B receptor
LigandBDBM50410564
Substrate/Competitorn/a
Meas. Tech.ChEMBL_321686 (CHEMBL872181)
IC50 11±n/a nM
Citation Buck, IMBlack, JWCooke, TDunstone, DJGaffen, JDGriffin, EPHarper, EAHull, RAKalindjian, SBLilley, EJLinney, IDLow, CMMcDonald, IMPether, MJRoberts, SPShankley, NPShaxted, MESteel, KISykes, DATozer, MJWatt, GFWalker, MKWright, LWright, PT Optimization of the in vitro and in vivo properties of a novel series of 2,4,5-trisubstituted imidazoles as potent cholecystokinin-2 (CCK2) antagonists. J Med Chem48:6803-12 (2005) 
 
Gastrin/cholecystokinin type B receptor
Name:Gastrin/cholecystokinin type B receptor
Type:Enzyme Catalytic Domain
Mol. Mass.:48544.19
Organism:Dog
Description:Cholecystokinin B 0 Dog::P30552
Residue:453
BDBM50410564
NameBDBM50410564
Synonyms:CHEMBL425574
TypeSmall organic molecule
Emp. Form.C31H41N3O3
Mol. Mass.503.6755
SMILESCc1ccc(NC(=O)c2[nH]c(nc2CCC23CC4CC(CC(C4)C2)C3)C2(C)CCCCC2)cc1C(O)=O