Reaction Details
TargetAdenosine receptor A2b
LigandBDBM50410697
Substrate/Competitorn/a
Meas. Tech.ChEMBL_330270 (CHEMBL862098)
Ki 1.55±n/a nM
Citation Carotti, ACadavid, MICenteno, NBEsteve, CLoza, MIMartinez, ANieto, RRaviña, ESanz, FSegarra, VSotelo, EStefanachi, AVidal, B Design, synthesis, and structure-activity relationships of 1-,3-,8-, and 9-substituted-9-deazaxanthines at the human A2B adenosine receptor. J Med Chem49:282-99 (2006) 
 
Adenosine receptor A2b
Name:Adenosine receptor A2b
Type:G Protein-Coupled Receptor (GPCR)
Mol. Mass.:36341.22
Organism:Homo sapiens (Human)
Description:n/a
Residue:332
BDBM50410697
NameBDBM50410697
Synonyms:CHEMBL370588
TypeSmall organic molecule
Emp. Form.C23H21BrN4O4
Mol. Mass.497.341
SMILESCC(Oc1ccc(cc1)-c1cc2n(C)c(=O)n(C)c(=O)c2[nH]1)C(=O)Nc1ccc(Br)cc1