Reaction Details
TargetAdenosine receptor A1
LigandBDBM50086166
Substrate/Competitorn/a
Meas. Tech.ChEMBL_330276 (CHEMBL853018)
Ki 63.1±n/a nM
Citation Carotti, ACadavid, MICenteno, NBEsteve, CLoza, MIMartinez, ANieto, RRaviña, ESanz, FSegarra, VSotelo, EStefanachi, AVidal, B Design, synthesis, and structure-activity relationships of 1-,3-,8-, and 9-substituted-9-deazaxanthines at the human A2B adenosine receptor. J Med Chem49:282-99 (2006) 
 
Adenosine receptor A1
Name:Adenosine receptor A1
Type:G Protein-Coupled Receptor (GPCR)
Mol. Mass.:36520.92
Organism:Homo sapiens (Human)
Description:P30542
Residue:326
BDBM50086166
NameBDBM50086166
Synonyms:CHEMBL275605 N-benzyl-2-(4-(2,6-dioxo-1,3-dipropyl-2,3,6,7-tetrahydro-1H-purin-8-yl)phenoxy)acetamide
TypeSmall organic molecule
Emp. Form.C26H29N5O4
Mol. Mass.475.5396
SMILESCCCn1c2nc([nH]c2c(=O)n(CCC)c1=O)-c1ccc(OCC(=O)NCc2ccccc2)cc1