Reaction Details
TargetAdenosine receptor A2a
LigandBDBM50410667
Substrate/Competitorn/a
Meas. Tech.ChEMBL_330271 (CHEMBL862097)
Ki 4897.79±n/a nM
Citation Carotti, ACadavid, MICenteno, NBEsteve, CLoza, MIMartinez, ANieto, RRaviña, ESanz, FSegarra, VSotelo, EStefanachi, AVidal, B Design, synthesis, and structure-activity relationships of 1-,3-,8-, and 9-substituted-9-deazaxanthines at the human A2B adenosine receptor. J Med Chem49:282-99 (2006) 
 
Adenosine receptor A2a
Name:Adenosine receptor A2a
Type:G Protein-Coupled Receptor (GPCR)
Mol. Mass.:44716.46
Organism:Homo sapiens (Human)
Description:P29274
Residue:412
BDBM50410667
NameBDBM50410667
Synonyms:CHEMBL201750
TypeSmall organic molecule
Emp. Form.C23H21BrN4O5
Mol. Mass.513.341
SMILESCOc1cc(OCC(=O)Nc2ccc(Br)cc2)ccc1-c1cc2n(C)c(=O)n(C)c(=O)c2[nH]1