Reaction Details
TargetAdenosine receptor A2b
LigandBDBM50410772
Substrate/Competitorn/a
Meas. Tech.ChEMBL_330270 (CHEMBL862098)
Ki 7.94±n/a nM
Citation Carotti, ACadavid, MICenteno, NBEsteve, CLoza, MIMartinez, ANieto, RRaviña, ESanz, FSegarra, VSotelo, EStefanachi, AVidal, B Design, synthesis, and structure-activity relationships of 1-,3-,8-, and 9-substituted-9-deazaxanthines at the human A2B adenosine receptor. J Med Chem49:282-99 (2006) 
 
Adenosine receptor A2b
Name:Adenosine receptor A2b
Type:G Protein-Coupled Receptor (GPCR)
Mol. Mass.:36341.22
Organism:Homo sapiens (Human)
Description:n/a
Residue:332
BDBM50410772
NameBDBM50410772
Synonyms:CHEMBL201157
TypeSmall organic molecule
Emp. Form.C28H32N4O4
Mol. Mass.488.5781
SMILESCCCn1c2cc([nH]c2c(=O)n(CCC)c1=O)-c1ccc(OC(C)(C)C(=O)Nc2ccccc2)cc1