Reaction Details
TargetAdenosine receptor A2a
LigandBDBM50410744
Substrate/Competitorn/a
Meas. Tech.ChEMBL_330271 (CHEMBL862097)
Ki 10.96±n/a nM
Citation Carotti, ACadavid, MICenteno, NBEsteve, CLoza, MIMartinez, ANieto, RRaviña, ESanz, FSegarra, VSotelo, EStefanachi, AVidal, B Design, synthesis, and structure-activity relationships of 1-,3-,8-, and 9-substituted-9-deazaxanthines at the human A2B adenosine receptor. J Med Chem49:282-99 (2006) 
 
Adenosine receptor A2a
Name:Adenosine receptor A2a
Type:G Protein-Coupled Receptor (GPCR)
Mol. Mass.:44716.46
Organism:Homo sapiens (Human)
Description:P29274
Residue:412
BDBM50410744
NameBDBM50410744
Synonyms:CHEMBL201407
TypeSmall organic molecule
Emp. Form.C24H24IN5O4
Mol. Mass.573.3829
SMILESCCCn1c2nc([nH]c2c(=O)n(CCC)c1=O)-c1ccc(OCC(=O)c2ccc(I)cc2)cn1