Reaction Details
TargetTryptase beta-2
LigandBDBM50410911
Substrate/Competitorn/a
Meas. Tech.ChEMBL_355795 (CHEMBL861143)
Ki 30000±n/a nM
Citation Pan, ZJeffery, DAChehade, KBeltman, JClark, JMGrothaus, PBogyo, MBaruch, A Development of activity-based probes for trypsin-family serine proteases. Bioorg Med Chem Lett16:2882-5 (2006) 
 
Tryptase beta-2
Name:Tryptase beta-2
Type:PROTEIN
Mol. Mass.:30518.79
Organism:Homo sapiens (Human)
Description:ChEMBL_210702
Residue:275
BDBM50410911
NameBDBM50410911
Synonyms:CHEMBL377737
TypeSmall organic molecule
Emp. Form.C38H72FN4O12PS
Mol. Mass.859.035
SMILESCCOP(F)(=O)CCCCCCCCCC(=O)NCCOCCOCCOCCOCCOCCOCCOCCNC(=O)CCCC[C@@H]1SC[C@@H]2NC(=O)N[C@H]12