Reaction Details
TargetPlasminogen
LigandBDBM50410912
Substrate/Competitorn/a
Meas. Tech.ChEMBL_355798 (CHEMBL861146)
Ki 4030±n/a nM
Citation Pan, ZJeffery, DAChehade, KBeltman, JClark, JMGrothaus, PBogyo, MBaruch, A Development of activity-based probes for trypsin-family serine proteases. Bioorg Med Chem Lett16:2882-5 (2006) 
 
Plasminogen
Name:Plasminogen
Type:Enzyme
Mol. Mass.:90579.18
Organism:Homo sapiens (Human)
Description:n/a
Residue:810
BDBM50410912
NameBDBM50410912
Synonyms:CHEMBL379174
TypeSmall organic molecule
Emp. Form.C42H64N7O12PS
Mol. Mass.922.036
SMILESNCCCC[C@@H](NC(=O)[C@H](CC(N)=O)NC(=O)CCOCCOCCOCCOCCNC(=O)CCCC[C@@H]1SC[C@@H]2NC(=O)N[C@H]12)P(=O)(Oc1ccccc1)Oc1ccccc1