Reaction Details
TargetProthrombin
LigandBDBM50410911
Substrate/Competitorn/a
Meas. Tech.ChEMBL_355797 (CHEMBL861145)
Ki 7900±n/a nM
Citation Pan, ZJeffery, DAChehade, KBeltman, JClark, JMGrothaus, PBogyo, MBaruch, A Development of activity-based probes for trypsin-family serine proteases. Bioorg Med Chem Lett16:2882-5 (2006) 
 
Prothrombin
Name:Prothrombin
Type:Protein
Mol. Mass.:70029.57
Organism:Homo sapiens (Human)
Description:P00734
Residue:622
BDBM50410911
NameBDBM50410911
Synonyms:CHEMBL377737
TypeSmall organic molecule
Emp. Form.C38H72FN4O12PS
Mol. Mass.859.035
SMILESCCOP(F)(=O)CCCCCCCCCC(=O)NCCOCCOCCOCCOCCOCCOCCOCCNC(=O)CCCC[C@@H]1SC[C@@H]2NC(=O)N[C@H]12