Reaction Details
TargetCathepsin B
LigandBDBM50410979
Substrate/Competitorn/a
Meas. Tech.ChEMBL_365369 (CHEMBL871199)
Ki 2±n/a nM
Citation Palmer, JTHirschbein, BLCheung, HMcCarter, JJanc, JWYu, ZWWesolowski, G Keto-1,3,4-oxadiazoles as cathepsin K inhibitors. Bioorg Med Chem Lett16:2909-14 (2006) 
 
Cathepsin B
Name:Cathepsin B
Type:Enzyme
Mol. Mass.:37819.69
Organism:Homo sapiens (Human)
Description:gi_63102437
Residue:339
BDBM50410979
NameBDBM50410979
Synonyms:CHEMBL207347
TypeSmall organic molecule
Emp. Form.C25H29N3O6
Mol. Mass.467.5143
SMILESCCC[C@H](NC(=O)[C@H](CC(C)C)C(=O)OCc1ccccc1)C(=O)c1nnc(o1)-c1ccco1