Reaction Details
TargetCathepsin K
LigandBDBM50410976
Substrate/Competitorn/a
Meas. Tech.ChEMBL_365368 (CHEMBL871198)
Ki 19±n/a nM
Citation Palmer, JTHirschbein, BLCheung, HMcCarter, JJanc, JWYu, ZWWesolowski, G Keto-1,3,4-oxadiazoles as cathepsin K inhibitors. Bioorg Med Chem Lett16:2909-14 (2006) 
 
Cathepsin K
Name:Cathepsin K
Type:Enzyme
Mol. Mass.:36975.68
Organism:Homo sapiens (Human)
Description:P43235
Residue:329
BDBM50410976
NameBDBM50410976
Synonyms:CHEMBL379157
TypeSmall organic molecule
Emp. Form.C25H27FN4O5
Mol. Mass.482.5041
SMILESCCC[C@H](NC(=O)C1(CCCCC1)NC(=O)c1ccc(F)cc1)C(=O)c1nnc(o1)-c1ccco1