Reaction Details
TargetTryptase beta-2
LigandBDBM50411000
Substrate/Competitorn/a
Meas. Tech.ChEMBL_370996 (CHEMBL868494)
Ki 9.8±n/a nM
Citation Palmer, JTRydzewski, RMMendonca, RVSperandio, DSpencer, JRHirschbein, BLLohman, JBeltman, JNguyen, MLiu, L Design and synthesis of selective keto-1,2,4-oxadiazole-based tryptase inhibitors. Bioorg Med Chem Lett16:3434-9 (2006) 
 
Tryptase beta-2
Name:Tryptase beta-2
Type:PROTEIN
Mol. Mass.:30518.79
Organism:Homo sapiens (Human)
Description:ChEMBL_210702
Residue:275
BDBM50411000
NameBDBM50411000
Synonyms:CHEMBL558178
TypeSmall organic molecule
Emp. Form.C29H36Cl2N4O4
Mol. Mass.575.527
SMILESCCCCCC(=O)N[C@@H](CCCCN)C(=O)c1noc(Cc2ccc(OCCc3ccc(Cl)c(Cl)c3)cc2)n1