Reaction Details
TargetProthrombin
LigandBDBM50410995
Substrate/Competitorn/a
Meas. Tech.ChEMBL_370998 (CHEMBL868496)
Ki>150000±n/a nM
Citation Palmer, JTRydzewski, RMMendonca, RVSperandio, DSpencer, JRHirschbein, BLLohman, JBeltman, JNguyen, MLiu, L Design and synthesis of selective keto-1,2,4-oxadiazole-based tryptase inhibitors. Bioorg Med Chem Lett16:3434-9 (2006) 
 
Prothrombin
Name:Prothrombin
Type:Protein
Mol. Mass.:70029.57
Organism:Homo sapiens (Human)
Description:P00734
Residue:622
BDBM50410995
NameBDBM50410995
Synonyms:CHEMBL536972
TypeSmall organic molecule
Emp. Form.C30H28Cl2F2N4O4
Mol. Mass.617.471
SMILESNCCCC[C@H](NC(=O)c1ccc(F)c(F)c1)C(=O)c1noc(Cc2ccc(OCCc3ccc(Cl)c(Cl)c3)cc2)n1