Reaction Details
TargetPlasma kallikrein
LigandBDBM50410995
Substrate/Competitorn/a
Meas. Tech.ChEMBL_371000 (CHEMBL868498)
Ki 83000±n/a nM
Citation Palmer, JTRydzewski, RMMendonca, RVSperandio, DSpencer, JRHirschbein, BLLohman, JBeltman, JNguyen, MLiu, L Design and synthesis of selective keto-1,2,4-oxadiazole-based tryptase inhibitors. Bioorg Med Chem Lett16:3434-9 (2006) 
 
Plasma kallikrein
Name:Plasma kallikrein
Type:Protein
Mol. Mass.:71391.16
Organism:Homo sapiens (Human)
Description:P03952
Residue:638
BDBM50410995
NameBDBM50410995
Synonyms:CHEMBL536972
TypeSmall organic molecule
Emp. Form.C30H28Cl2F2N4O4
Mol. Mass.617.471
SMILESNCCCC[C@H](NC(=O)c1ccc(F)c(F)c1)C(=O)c1noc(Cc2ccc(OCCc3ccc(Cl)c(Cl)c3)cc2)n1