Reaction Details
TargetGlucocorticoid receptor
LigandBDBM50411034
Substrate/Competitorn/a
Meas. Tech.ChEMBL_372312 (CHEMBL869701)
IC50 3.16±n/a nM
Citation Barker, MClackers, MCopley, RDemaine, DAHumphreys, DInglis, GGJohnston, MJJones, HTHaase, MVHouse, DLoiseau, RNisbet, LPacquet, FSkone, PAShanahan, SETape, DVinader, VMWashington, MUings, IUpton, RMcLay, IMMacdonald, SJ Dissociated nonsteroidal glucocorticoid receptor modulators; discovery of the agonist trigger in a tetrahydronaphthalene-benzoxazine series. J Med Chem49:4216-31 (2006) 
 
Glucocorticoid receptor
Name:Glucocorticoid receptor
Type:Enzyme
Mol. Mass.:85656.87
Organism:Homo sapiens (Human)
Description:P04150
Residue:777
BDBM50411034
NameBDBM50411034
Synonyms:CHEMBL378785
TypeSmall organic molecule
Emp. Form.C24H23F3N2O4
Mol. Mass.460.4456
SMILESCc1cccc2C(CC(O)(C(=O)Nc3ccc4c(c3)c(C)noc4=O)C(F)(F)F)CCCc12