Reaction Details
TargetGlucocorticoid receptor
LigandBDBM50411047
Substrate/Competitorn/a
Meas. Tech.ChEMBL_372313 (CHEMBL869702)
IC50 1.2±n/a nM
Citation Barker, MClackers, MCopley, RDemaine, DAHumphreys, DInglis, GGJohnston, MJJones, HTHaase, MVHouse, DLoiseau, RNisbet, LPacquet, FSkone, PAShanahan, SETape, DVinader, VMWashington, MUings, IUpton, RMcLay, IMMacdonald, SJ Dissociated nonsteroidal glucocorticoid receptor modulators; discovery of the agonist trigger in a tetrahydronaphthalene-benzoxazine series. J Med Chem49:4216-31 (2006) 
 
Glucocorticoid receptor
Name:Glucocorticoid receptor
Type:Enzyme
Mol. Mass.:85656.87
Organism:Homo sapiens (Human)
Description:P04150
Residue:777
BDBM50411047
NameBDBM50411047
Synonyms:CHEMBL211441
TypeSmall organic molecule
Emp. Form.C28H31F3N2O4
Mol. Mass.516.5519
SMILESCCC(CC)C1(CC(O)(C(=O)Nc2ccc3c(c2)c(C)noc3=O)C(F)(F)F)CCCc2ccccc12