Reaction Details
TargetGlucocorticoid receptor
LigandBDBM50411044
Substrate/Competitorn/a
Meas. Tech.ChEMBL_372312 (CHEMBL869701)
IC50 16±n/a nM
Citation Barker, MClackers, MCopley, RDemaine, DAHumphreys, DInglis, GGJohnston, MJJones, HTHaase, MVHouse, DLoiseau, RNisbet, LPacquet, FSkone, PAShanahan, SETape, DVinader, VMWashington, MUings, IUpton, RMcLay, IMMacdonald, SJ Dissociated nonsteroidal glucocorticoid receptor modulators; discovery of the agonist trigger in a tetrahydronaphthalene-benzoxazine series. J Med Chem49:4216-31 (2006) 
 
Glucocorticoid receptor
Name:Glucocorticoid receptor
Type:Enzyme
Mol. Mass.:85656.87
Organism:Homo sapiens (Human)
Description:P04150
Residue:777
BDBM50411044
NameBDBM50411044
Synonyms:CHEMBL211854
TypeSmall organic molecule
Emp. Form.C23H20F4N2O4
Mol. Mass.464.4095
SMILESCc1noc(=O)c2ccc(NC(=O)C(O)(CC3CCCc4c(F)cccc34)C(F)(F)F)cc12