Reaction Details
TargetGlucocorticoid receptor
LigandBDBM50411026
Substrate/Competitorn/a
Meas. Tech.ChEMBL_372313 (CHEMBL869702)
IC50 3±n/a nM
Citation Barker, MClackers, MCopley, RDemaine, DAHumphreys, DInglis, GGJohnston, MJJones, HTHaase, MVHouse, DLoiseau, RNisbet, LPacquet, FSkone, PAShanahan, SETape, DVinader, VMWashington, MUings, IUpton, RMcLay, IMMacdonald, SJ Dissociated nonsteroidal glucocorticoid receptor modulators; discovery of the agonist trigger in a tetrahydronaphthalene-benzoxazine series. J Med Chem49:4216-31 (2006) 
 
Glucocorticoid receptor
Name:Glucocorticoid receptor
Type:Enzyme
Mol. Mass.:85656.87
Organism:Homo sapiens (Human)
Description:P04150
Residue:777
BDBM50411026
NameBDBM50411026
Synonyms:CHEMBL214336
TypeSmall organic molecule
Emp. Form.C26H27F3N2O4
Mol. Mass.488.4988
SMILESCC(C)C1(CC(O)(C(=O)Nc2ccc3c(c2)c(C)noc3=O)C(F)(F)F)CCCc2ccccc12