Reaction Details
TargetGlucocorticoid receptor
LigandBDBM50411032
Substrate/Competitorn/a
Meas. Tech.ChEMBL_372312 (CHEMBL869701)
IC50 7.9±n/a nM
Citation Barker, MClackers, MCopley, RDemaine, DAHumphreys, DInglis, GGJohnston, MJJones, HTHaase, MVHouse, DLoiseau, RNisbet, LPacquet, FSkone, PAShanahan, SETape, DVinader, VMWashington, MUings, IUpton, RMcLay, IMMacdonald, SJ Dissociated nonsteroidal glucocorticoid receptor modulators; discovery of the agonist trigger in a tetrahydronaphthalene-benzoxazine series. J Med Chem49:4216-31 (2006) 
 
Glucocorticoid receptor
Name:Glucocorticoid receptor
Type:Enzyme
Mol. Mass.:85656.87
Organism:Homo sapiens (Human)
Description:P04150
Residue:777
BDBM50411032
NameBDBM50411032
Synonyms:CHEMBL209259
TypeSmall organic molecule
Emp. Form.C25H24F3N3O6
Mol. Mass.519.4698
SMILESCCC1(CC(O)(C(=O)Nc2ccc3c(c2)c(C)noc3=O)C(F)(F)F)CCCc2cc(ccc12)[N+]([O-])=O