Reaction Details
TargetGlucocorticoid receptor
LigandBDBM50411038
Substrate/Competitorn/a
Meas. Tech.ChEMBL_372312 (CHEMBL869701)
IC50 11.7±n/a nM
Citation Barker, MClackers, MCopley, RDemaine, DAHumphreys, DInglis, GGJohnston, MJJones, HTHaase, MVHouse, DLoiseau, RNisbet, LPacquet, FSkone, PAShanahan, SETape, DVinader, VMWashington, MUings, IUpton, RMcLay, IMMacdonald, SJ Dissociated nonsteroidal glucocorticoid receptor modulators; discovery of the agonist trigger in a tetrahydronaphthalene-benzoxazine series. J Med Chem49:4216-31 (2006) 
 
Glucocorticoid receptor
Name:Glucocorticoid receptor
Type:Enzyme
Mol. Mass.:85656.87
Organism:Homo sapiens (Human)
Description:P04150
Residue:777
BDBM50411038
NameBDBM50411038
Synonyms:CHEMBL214333
TypeSmall organic molecule
Emp. Form.C24H23F3N2O5
Mol. Mass.476.445
SMILESCCC1(CC(O)(C(=O)Nc2ccc3c(c2)c(C)noc3=O)C(F)(F)F)CCOc2ccccc12