Reaction Details
TargetGlucocorticoid receptor
LigandBDBM50411024
Substrate/Competitorn/a
Meas. Tech.ChEMBL_372313 (CHEMBL869702)
IC50 2±n/a nM
Citation Barker, MClackers, MCopley, RDemaine, DAHumphreys, DInglis, GGJohnston, MJJones, HTHaase, MVHouse, DLoiseau, RNisbet, LPacquet, FSkone, PAShanahan, SETape, DVinader, VMWashington, MUings, IUpton, RMcLay, IMMacdonald, SJ Dissociated nonsteroidal glucocorticoid receptor modulators; discovery of the agonist trigger in a tetrahydronaphthalene-benzoxazine series. J Med Chem49:4216-31 (2006) 
 
Glucocorticoid receptor
Name:Glucocorticoid receptor
Type:Enzyme
Mol. Mass.:85656.87
Organism:Homo sapiens (Human)
Description:P04150
Residue:777
BDBM50411024
NameBDBM50411024
Synonyms:CHEMBL208996
TypeSmall organic molecule
Emp. Form.C28H29F3N2O4
Mol. Mass.514.5361
SMILESCc1noc(=O)c2ccc(NC(=O)[C@](O)(C[C@]3(CCCc4ccccc34)C3CCCC3)C(F)(F)F)cc12