Reaction Details
TargetReverse transcriptase/RNaseH
LigandBDBM50411073
Substrate/Competitorn/a
Meas. Tech.ChEMBL_373032 (CHEMBL871579)
EC50>57500±n/a nM
Citation Mugnaini, CManetti, FEsté, JAClotet-Codina, IMaga, GCancio, RBotta, MCorelli, F Synthesis and biological investigation of S-aryl-S-DABO derivatives as HIV-1 inhibitors. Bioorg Med Chem Lett16:3541-4 (2006) 
 
Reverse transcriptase/RNaseH
Name:Reverse transcriptase/RNaseH
Type:PROTEIN
Mol. Mass.:65229.15
Organism:Human immunodeficiency virus 1
Description:ChEMBL_1473730
Residue:566
BDBM50411073
NameBDBM50411073
Synonyms:CHEMBL211343
TypeSmall organic molecule
Emp. Form.C19H16F2N2O2S
Mol. Mass.374.404
SMILESCOc1ccc(Sc2nc(Cc3c(F)cccc3F)c(C)c(=O)[nH]2)cc1